Reaction Details
TargetMetabotropic glutamate receptor 4
LigandBDBM50293732
Substrate/Competitorn/a
Meas. Tech.ChEMBL_571886 (CHEMBL1034756)
EC50 1400±n/a nM
Citation Engers, DWNiswender, CMWeaver, CDJadhav, SMenon, UNZamorano, RConn, PJLindsley, CWHopkins, CR Synthesis and evaluation of a series of heterobiarylamides that are centrally penetrant metabotropic glutamate receptor 4 (mGluR4) positive allosteric modulators (PAMs). J Med Chem52:4115-8 (2009) 
 
Metabotropic glutamate receptor 4
Name:Metabotropic glutamate receptor 4
Type:Protein
Mol. Mass.:101899.95
Organism:Homo sapiens (Human)
Description:Q14833
Residue:912
BDBM50293732
NameBDBM50293732
Synonyms:CHEMBL549330 cid_4644726
TypeSmall organic molecule
Emp. Form.C12H8Cl2N2O
Mol. Mass.267.111
SMILESClc1ccc(NC(=O)c2ccccn2)cc1Cl