Reaction Details
TargetMetabotropic glutamate receptor 4
LigandBDBM50293733
Substrate/Competitorn/a
Meas. Tech.ChEMBL_571886 (CHEMBL1034756)
EC50>10000±n/a nM
Citation Engers, DWNiswender, CMWeaver, CDJadhav, SMenon, UNZamorano, RConn, PJLindsley, CWHopkins, CR Synthesis and evaluation of a series of heterobiarylamides that are centrally penetrant metabotropic glutamate receptor 4 (mGluR4) positive allosteric modulators (PAMs). J Med Chem52:4115-8 (2009) 
 
Metabotropic glutamate receptor 4
Name:Metabotropic glutamate receptor 4
Type:Protein
Mol. Mass.:101899.95
Organism:Homo sapiens (Human)
Description:Q14833
Residue:912
BDBM50293733
NameBDBM50293733
Synonyms:CHEMBL559828 | N-(3,4-dichlorophenyl)pyrazine-2-carboxamide
TypeSmall organic molecule
Emp. Form.C11H7Cl2N3O
Mol. Mass.268.099
SMILESClc1ccc(NC(=O)c2cnccn2)cc1Cl