Reaction Details
TargetMetabotropic glutamate receptor 4
LigandBDBM50293742
Substrate/Competitorn/a
Meas. Tech.ChEMBL_571886 (CHEMBL1034756)
EC50>10000±n/a nM
Citation Engers, DWNiswender, CMWeaver, CDJadhav, SMenon, UNZamorano, RConn, PJLindsley, CWHopkins, CR Synthesis and evaluation of a series of heterobiarylamides that are centrally penetrant metabotropic glutamate receptor 4 (mGluR4) positive allosteric modulators (PAMs). J Med Chem52:4115-8 (2009) 
 
Metabotropic glutamate receptor 4
Name:Metabotropic glutamate receptor 4
Type:Protein
Mol. Mass.:101899.95
Organism:Homo sapiens (Human)
Description:Q14833
Residue:912
BDBM50293742
NameBDBM50293742
Synonyms:CHEMBL569148 cid_44191179
TypeSmall organic molecule
Emp. Form.C14H8F3N3O
Mol. Mass.291.228
SMILESFC(F)(F)c1cc(NC(=O)c2ccccn2)ccc1C#N