Reaction Details
TargetMetabotropic glutamate receptor 4
LigandBDBM50263669
Substrate/Competitorn/a
Meas. Tech.ChEMBL_571881 (CHEMBL1034751)
EC50 2030±n/a nM
Citation Engers, DWNiswender, CMWeaver, CDJadhav, SMenon, UNZamorano, RConn, PJLindsley, CWHopkins, CR Synthesis and evaluation of a series of heterobiarylamides that are centrally penetrant metabotropic glutamate receptor 4 (mGluR4) positive allosteric modulators (PAMs). J Med Chem52:4115-8 (2009) 
 
Metabotropic glutamate receptor 4
Name:Metabotropic glutamate receptor 4
Type:Enzyme
Mol. Mass.:101849.79
Organism:Rattus norvegicus (Rat)
Description:P31423
Residue:912
BDBM50263669
NameBDBM50263669
Synonyms:(1aS,7aS)-7-(hydroxyimino)-N-phenyl-1,1a,7,7a-tetrahydrocyclopropa[b]chromene-1a-carboxamide
TypeSmall organic molecule
Emp. Form.C17H14N2O3
Mol. Mass.294.3047
SMILESO=NC1[C@@H]2C[C@@]2(Oc2ccccc12)C(=O)Nc1ccccc1