Reaction Details
TargetD(3) dopamine receptor
LigandBDBM50294116
Substrate/Competitorn/a
Meas. Tech.ChEMBL_570900 (CHEMBL1031097)
Ki 17±n/a nM
Citation Ehrlich, KGötz, ABollinger, STschammer, NBettinetti, LHärterich, SHübner, HLanig, HGmeiner, P Dopamine D2, D3, and D4 selective phenylpiperazines as molecular probes to explore the origins of subtype specific receptor binding. J Med Chem52:4923-35 (2009) 
 
D(3) dopamine receptor
Name:D(3) dopamine receptor
Type:n/a
Mol. Mass.:44243.43
Organism:Homo sapiens (Human)
Description:n/a
Residue:400
BDBM50294116
NameBDBM50294116
Synonyms:CHEMBL561763 | N-[3-[4-(2-Methylsulfanylphenyl)piperazin-1-yl]propyl]pyrazolo-[1,5-a]pyridine-3-carboxamide
TypeSmall organic molecule
Emp. Form.C22H27N5OS
Mol. Mass.409.548
SMILESCSc1ccccc1N1CCN(CCCNC(=O)c2cnn3ccccc23)CC1