Reaction Details
TargetD(3) dopamine receptor
LigandBDBM50119375
Substrate/Competitorn/a
Meas. Tech.ChEMBL_570886 (CHEMBL1031083)
Ki 150±n/a nM
Citation Ehrlich, KGötz, ABollinger, STschammer, NBettinetti, LHärterich, SHübner, HLanig, HGmeiner, P Dopamine D2, D3, and D4 selective phenylpiperazines as molecular probes to explore the origins of subtype specific receptor binding. J Med Chem52:4923-35 (2009) 
 
D(3) dopamine receptor
Name:D(3) dopamine receptor
Type:n/a
Mol. Mass.:44243.43
Organism:Homo sapiens (Human)
Description:n/a
Residue:400
BDBM50119375
NameBDBM50119375
Synonyms:CHEMBL140612 Pyrazolo[1,5-a]pyridine-3-carboxylic acid {3-[4-(2-methoxy-phenyl)-piperazin-1-yl]-propyl}-amide
TypeSmall organic molecule
Emp. Form.C22H27N5O2
Mol. Mass.393.4821
SMILESCOc1ccccc1N1CCN(CCCNC(=O)c2cnn3ccccc23)CC1