Reaction Details
TargetAdenosine receptor A2a
LigandBDBM50294505
Substrate/Competitorn/a
Meas. Tech.ChEMBL_575569 (CHEMBL1036412)
Ki 2.6±n/a nM
Citation Gillespie, RJBamford, SJGaur, SJordan, AMLerpiniere, JMansell, HLStratton, GC Antagonists of the human A(2A) receptor. Part 5: Highly bio-available pyrimidine-4-carboxamides. Bioorg Med Chem Lett19:2664-7 (2009) 
 
Adenosine receptor A2a
Name:Adenosine receptor A2a
Type:G Protein-Coupled Receptor (GPCR)
Mol. Mass.:44716.46
Organism:Homo sapiens (Human)
Description:P29274
Residue:412
BDBM50294505
NameBDBM50294505
Synonyms:2-amino-N-(2-chlorobenzyl)-6-(furan-2-yl)pyrimidine-4-carboxamide | CHEMBL560904
TypeSmall organic molecule
Emp. Form.C16H13ClN4O2
Mol. Mass.328.753
SMILESNc1nc(cc(n1)-c1ccco1)C(=O)NCc1ccccc1Cl