Reaction Details
TargetAdenosine receptor A2a
LigandBDBM50294511
Substrate/Competitorn/a
Meas. Tech.ChEMBL_575569 (CHEMBL1036412)
Ki 6.1±n/a nM
Citation Gillespie, RJBamford, SJGaur, SJordan, AMLerpiniere, JMansell, HLStratton, GC Antagonists of the human A(2A) receptor. Part 5: Highly bio-available pyrimidine-4-carboxamides. Bioorg Med Chem Lett19:2664-7 (2009) 
 
Adenosine receptor A2a
Name:Adenosine receptor A2a
Type:G Protein-Coupled Receptor (GPCR)
Mol. Mass.:44716.46
Organism:Homo sapiens (Human)
Description:P29274
Residue:412
BDBM50294511
NameBDBM50294511
Synonyms:2-amino-6-(furan-2-yl)-N-(3-methoxybenzyl)pyrimidine-4-carboxamide | CHEMBL549477
TypeSmall organic molecule
Emp. Form.C17H16N4O3
Mol. Mass.324.3339
SMILESCOc1cccc(CNC(=O)c2cc(nc(N)n2)-c2ccco2)c1