Reaction Details
TargetAdenosine receptor A2a
LigandBDBM50294501
Substrate/Competitorn/a
Meas. Tech.ChEMBL_575569 (CHEMBL1036412)
Ki 1.7±n/a nM
Citation Gillespie, RJBamford, SJGaur, SJordan, AMLerpiniere, JMansell, HLStratton, GC Antagonists of the human A(2A) receptor. Part 5: Highly bio-available pyrimidine-4-carboxamides. Bioorg Med Chem Lett19:2664-7 (2009) 
 
Adenosine receptor A2a
Name:Adenosine receptor A2a
Type:G Protein-Coupled Receptor (GPCR)
Mol. Mass.:44716.46
Organism:Homo sapiens (Human)
Description:P29274
Residue:412
BDBM50294501
NameBDBM50294501
Synonyms:2-amino-6-(furan-2-yl)-N-((6-(methoxymethyl)pyridin-2-yl)methyl)pyrimidine-4-carboxamide | CHEMBL564473
TypeSmall organic molecule
Emp. Form.C17H17N5O3
Mol. Mass.339.3486
SMILESCOCc1cccc(CNC(=O)c2cc(nc(N)n2)-c2ccco2)n1