Reaction Details
TargetDNA (cytosine-5)-methyltransferase 1
LigandBDBM50294557
Substrate/Competitorn/a
Meas. Tech.ChEMBL_575599 (CHEMBL1036444)
IC50 1100±n/a nM
Citation Isakovic, LSaavedra, OMLlewellyn, DBClaridge, SZhan, LBernstein, NVaisburg, AElowe, NPetschner, AJRahil, JBeaulieu, NGauthier, FMacLeod, ARDelorme, DBesterman, JMWahhab, A Constrained (l-)-S-adenosyl-l-homocysteine (SAH) analogues as DNA methyltransferase inhibitors. Bioorg Med Chem Lett19:2742-6 (2009) 
 
DNA (cytosine-5)-methyltransferase 1
Name:DNA (cytosine-5)-methyltransferase 1
Type:Enzyme
Mol. Mass.:183184.85
Organism:Homo sapiens (Human)
Description:P26358
Residue:1616
BDBM50294557
NameBDBM50294557
Synonyms:(2S,4S)-4-(((2S,3S,4R,5R)-5-(6-amino-9H-purin-9-yl)-3,4-dihydroxytetrahydrofuran-2-yl)methylthio)pyrrolidine-2-carboxylic acid | CHEMBL557902
TypeSmall organic molecule
Emp. Form.C15H20N6O5S
Mol. Mass.396.422
SMILESNc1ncnc2n(cnc12)[C@@H]1O[C@H](CS[C@@H]2CN[C@@H](C2)C(O)=O)[C@@H](O)[C@H]1O