Reaction Details
TargetProkineticin receptor 1
LigandBDBM50294592
Substrate/Competitorn/a
Meas. Tech.ChEMBL_575799 (CHEMBL1057723)
IC50 318±n/a nM
Citation Ralbovsky, JLLisko, JGPalmer, JMMabus, JChevalier, KMSchulz, MJDyatkin, ABMiskowski, TACoats, SJHornby, PHe, W Triazinediones as prokineticin 1 receptor antagonists. Part 1: SAR, synthesis and biological evaluation. Bioorg Med Chem Lett19:2661-3 (2009) 
 
Prokineticin receptor 1
Name:Prokineticin receptor 1
Type:enzyme
Mol. Mass.:44779.92
Organism:Homo sapiens (Human)
Description:Q8TCW9
Residue:393
BDBM50294592
NameBDBM50294592
Synonyms:1-(2-(5-(4-cyanobenzyl)-1-(4-methoxybenzyl)-4,6-dioxo-1,4,5,6-tetrahydro-1,3,5-triazin-2-ylamino)ethyl)guanidine | CHEMBL562508
TypeSmall organic molecule
Emp. Form.C22H24N8O3
Mol. Mass.448.4778
SMILES[#6]-[#8]-c1ccc(-[#6]-n2c(-[#7]-[#6]-[#6]\[#7]=[#6](\[#7])-[#7])nc(=O)n(-[#6]-c3ccc(cc3)C#N)c2=O)cc1