Reaction Details
TargetProkineticin receptor 1
LigandBDBM50294597
Substrate/Competitorn/a
Meas. Tech.ChEMBL_575799 (CHEMBL1057723)
IC50>10000±n/a nM
Citation Ralbovsky, JLLisko, JGPalmer, JMMabus, JChevalier, KMSchulz, MJDyatkin, ABMiskowski, TACoats, SJHornby, PHe, W Triazinediones as prokineticin 1 receptor antagonists. Part 1: SAR, synthesis and biological evaluation. Bioorg Med Chem Lett19:2661-3 (2009) 
 
Prokineticin receptor 1
Name:Prokineticin receptor 1
Type:enzyme
Mol. Mass.:44779.92
Organism:Homo sapiens (Human)
Description:Q8TCW9
Residue:393
BDBM50294597
NameBDBM50294597
Synonyms:1-(2-(5-(4-fluorobenzyl)-1-(4-nitrobenzyl)-4,6-dioxo-1,4,5,6-tetrahydro-1,3,5-triazin-2-ylamino)ethyl)guanidine | CHEMBL562609
TypeSmall organic molecule
Emp. Form.C20H21FN8O4
Mol. Mass.456.4303
SMILES[#7]\[#6](-[#7])=[#7]\[#6]-[#6]-[#7]-c1nc(=O)n(-[#6]-c2ccc(F)cc2)c(=O)n1-[#6]-c1ccc(cc1)-[#7+](-[#8-])=O