Reaction Details
TargetCoagulation factor VII
LigandBDBM50269776
Substrate/Competitorn/a
Meas. Tech.ChEMBL_577000 (CHEMBL1036291)
Ki 110±n/a nM
Citation Wang, GGoyal, NHopkinson, B Preparation of L-proline based aeruginosin 298-A analogs: optimization of the P1-moiety. Bioorg Med Chem Lett19:3798-803 (2009) 
 
Coagulation factor VII
Name:Coagulation factor VII
Type:Enzyme
Mol. Mass.:51599.89
Organism:Homo sapiens (Human)
Description:n/a
Residue:466
BDBM50269776
NameBDBM50269776
Synonyms:CHEMBL502639 | Dysinosin A
TypeSmall organic molecule
Emp. Form.C26H44N6O10S
Mol. Mass.632.727
SMILES[#6]-[#8]-[#6@H](-[#6]-[#8]S([#8-])(=O)=O)-[#6](=O)-[#7]-[#6@H](-[#6]-[#6](-[#6])-[#6])-[#6](=O)-[#7]-1-[#6@H]-2-[#6]-[#6@H](-[#8])-[#6@@H](-[#8])-[#6]-[#6@H]-2-[#6]-[#6@H]-1-[#6](=O)-[#7]-[#6]-[#6]-[#6]-1=[#6]-[#6]\[#7+](-[#6]-1)=[#6](\[#7])-[#7]