Reaction Details
TargetProthrombin
LigandBDBM50269776
Substrate/Competitorn/a
Meas. Tech.ChEMBL_576998 (CHEMBL1035435)
Ki 450±n/a nM
Citation Wang, GGoyal, NHopkinson, B Preparation of L-proline based aeruginosin 298-A analogs: optimization of the P1-moiety. Bioorg Med Chem Lett19:3798-803 (2009) 
 
Prothrombin
Name:Prothrombin
Type:Protein
Mol. Mass.:70029.57
Organism:Homo sapiens (Human)
Description:P00734
Residue:622
BDBM50269776
NameBDBM50269776
Synonyms:CHEMBL502639 | Dysinosin A
TypeSmall organic molecule
Emp. Form.C26H44N6O10S
Mol. Mass.632.727
SMILES[#6]-[#8]-[#6@H](-[#6]-[#8]S([#8-])(=O)=O)-[#6](=O)-[#7]-[#6@H](-[#6]-[#6](-[#6])-[#6])-[#6](=O)-[#7]-1-[#6@H]-2-[#6]-[#6@H](-[#8])-[#6@@H](-[#8])-[#6]-[#6@H]-2-[#6]-[#6@H]-1-[#6](=O)-[#7]-[#6]-[#6]-[#6]-1=[#6]-[#6]\[#7+](-[#6]-1)=[#6](\[#7])-[#7]