Reaction Details
TargetSodium-dependent serotonin transporter
LigandBDBM50295053
Substrate/Competitorn/a
Meas. Tech.ChEMBL_574190 (CHEMBL1060391)
Ki 2.34±n/a nM
Citation Zhou, DStack, GPLo, JFailli, AAEvrard, DAHarrison, BLHatzenbuhler, NTTran, MCroce, SYi, SGolembieski, JHornby, GALai, MLin, QSchechter, LESmith, DLShilling, ADHuselton, CMitchell, PBeyer, CEAndree, TH Synthesis, potency, and in vivo evaluation of 2-piperazin-1-ylquinoline analogues as dual serotonin reuptake inhibitors and serotonin 5-HT1A receptor antagonists. J Med Chem52:4955-9 (2009) 
 
Sodium-dependent serotonin transporter
Name:Sodium-dependent serotonin transporter
Type:Multi-pass membrane protein
Mol. Mass.:70168.43
Organism:Rattus norvegicus (rat)
Description:P31652
Residue:630
BDBM50295053
NameBDBM50295053
Synonyms:(S)-2-((4-(1H-Indol-3-yl)-5,6-dihydropyridin-1(2H)-yl)-methyl)-8-methyl-2,3-dihydro-[1,4]dioxino-[2,3-f]quinoline | CHEMBL562248
TypeSmall organic molecule
Emp. Form.C26H25N3O2
Mol. Mass.411.4956
SMILESCc1ccc2c3O[C@@H](CN4CCC(=CC4)c4c[nH]c5ccccc45)COc3ccc2n1