Reaction Details
TargetHistamine H3 receptor
LigandBDBM22541
Substrate/Competitorn/a
Meas. Tech.ChEMBL_577510 (CHEMBL1057862)
Ki 0.6±n/a nM
Citation Mitobe, YIto, SMizutani, TNagase, TSato, NTokita, S Development of a selective and potent radioactive ligand for histamine H(3) receptors: A compound potentially useful for receptor occupancy studies. Bioorg Med Chem Lett19:4075-8 (2009) 
 
Histamine H3 receptor
Name:Histamine H3 receptor
Type:PROTEIN
Mol. Mass.:48560.37
Organism:Mus musculus
Description:ChEMBL_988451
Residue:445
BDBM22541
NameBDBM22541
Synonyms:Clobenpropit VUF 9153 VUF9153
TypeSmall organic molecule
Emp. Form.C14H17ClN4S
Mol. Mass.308.83
SMILESNC(SCCCc1cnc[nH]1)=NCc1ccc(Cl)cc1