Reaction Details
TargetNeuromedin-B receptor
LigandBDBM50295234
Substrate/Competitorn/a
Meas. Tech.ChEMBL_577514 (CHEMBL1057866)
IC50 540±n/a nM
Citation Fu, JShuttleworth, SJConnors, RVChai, ACoward, P Discovery and optimization of a novel Neuromedin B receptor antagonist. Bioorg Med Chem Lett19:4264-7 (2009) 
 
Neuromedin-B receptor
Name:Neuromedin-B receptor
Type:Enzyme Catalytic Domain
Mol. Mass.:43447.11
Organism:Homo sapiens (Human)
Description:Bombesin 1 NMBR 0::P28336
Residue:390
BDBM50295234
NameBDBM50295234
Synonyms:11'-(2-fluoro-6-(trifluoromethyl)phenyl)-8'-methyl-4',5',10',11'-tetrahydrospiro[cyclopentane-1,3'-dibenzo[b,e][1,4]diazepin]-1'(2'H)-one | CHEMBL550567
TypeSmall organic molecule
Emp. Form.C25H24F4N2O
Mol. Mass.444.4645
SMILESCc1ccc2N=C3CC4(CCCC4)CC(=O)C3C(Nc2c1)c1c(F)cccc1C(F)(F)F