Reaction Details
TargetInterleukin-8
LigandBDBM50295287
Substrate/Competitorn/a
Meas. Tech.ChEMBL_577736 (CHEMBL1052371)
IC50 90±n/a nM
Citation Sablone, MRCesta, MCMoriconi, AAramini, ABizzarri, CDi Giacinto, CDi Bitondo, RGloaguen, IAschi, MCrucianelli, MBertini, RAllegretti, M Structure-Activity Relationship of novel phenylacetic CXCR1 inhibitors. Bioorg Med Chem Lett19:4026-30 (2009) 
 
Interleukin-8
Name:Interleukin-8
Type:PROTEIN
Mol. Mass.:11104.05
Organism:Homo sapiens (Human)
Description:ChEMBL_577736
Residue:99
BDBM50295287
NameBDBM50295287
Synonyms:2-(1-methyl-5-(4-methylbenzoyl)-1H-pyrrol-2-yl)acetic acid MCN-2559 Tolectin [1-Methyl-5-(4-methyl-benzoyl)-1H-pyrrol-2-yl]-acetic acid(tolmetin)
TypeSmall organic molecule
Emp. Form.C15H15NO3
Mol. Mass.257.2845
SMILESCc1ccc(cc1)C(=O)c1ccc(CC(O)=O)n1C