Reaction Details
TargetGlycogen phosphorylase, muscle form
LigandBDBM50263826
Substrate/Competitorn/a
Meas. Tech.ChEMBL_578067 (CHEMBL1051629)
Ki 160±n/a nM
Citation Nagy, VBenltifa, MVidal, SBerzsényi, ETeilhet, CCzifrák, KBatta, GDocsa, TGergely, PSomsák, LPraly, JP Glucose-based spiro-heterocycles as potent inhibitors of glycogen phosphorylase. Bioorg Med Chem17:5696-707 (2009) 
 
Glycogen phosphorylase, muscle form
Name:Glycogen phosphorylase, muscle form
Type:Enzyme
Mol. Mass.:97296.32
Organism:Oryctolagus cuniculus (rabbit)
Description:Phosphorylation of Ser-15 converts phosphorylase B (unphosphorylated) to phosphorylase A.
Residue:843
BDBM50263826
NameBDBM50263826
Synonyms:(1S)-1,5-Anhydro-D-glucitol-spiro[1.5]-3-(2-naphthyl)-1,4,2-oxathiazole CHEMBL490175
TypeSmall organic molecule
Emp. Form.C17H17NO6S
Mol. Mass.363.385
SMILESOC[C@H]1O[C@]2(ON=C(S2)c2ccc3ccccc3c2)[C@H](O)[C@@H](O)[C@@H]1O