Reaction Details
TargetNociceptin receptor
LigandBDBM50295447
Substrate/Competitorn/a
Meas. Tech.ChEMBL_578685 (CHEMBL1063066)
Ki 286±n/a nM
Citation Yang, SWHo, GTulshian, DGreenlee, WJAnthes, JFernandez, XMcLeod, RLHey, JAXu, X Discovery of orally active 3-pyridinyl-tropane as a potent nociceptin receptor agonist for the management of cough. J Med Chem52:5323-9 (2009) 
 
Nociceptin receptor
Name:Nociceptin receptor
Type:G Protein-Coupled Receptor (GPCR)
Mol. Mass.:40702.87
Organism:Homo sapiens (Human)
Description:P41146
Residue:370
BDBM50295447
NameBDBM50295447
Synonyms:CHEMBL3084637 | Exo-8-[bis(2-chlorophenyl)methyl]-3-(3-pyridinyl)-8-azabicyclo[3.2.1]octane
TypeSmall organic molecule
Emp. Form.C25H24Cl2N2
Mol. Mass.423.377
SMILES[H][C@]12CC[C@]([H])(C[C@@H](C1)c1cccnc1)N2C(c1ccccc1Cl)c1ccccc1Cl