Reaction Details
TargetNociceptin receptor
LigandBDBM50295452
Substrate/Competitorn/a
Meas. Tech.ChEMBL_578685 (CHEMBL1063066)
Ki 1±n/a nM
Citation Yang, SWHo, GTulshian, DGreenlee, WJAnthes, JFernandez, XMcLeod, RLHey, JAXu, X Discovery of orally active 3-pyridinyl-tropane as a potent nociceptin receptor agonist for the management of cough. J Med Chem52:5323-9 (2009) 
 
Nociceptin receptor
Name:Nociceptin receptor
Type:G Protein-Coupled Receptor (GPCR)
Mol. Mass.:40702.87
Organism:Homo sapiens (Human)
Description:P41146
Residue:370
BDBM50295452
NameBDBM50295452
Synonyms:CHEMBL3084677 | exo-8-[Bis(2-chlorophenyl)methyl]-3-(1-methyl-2-piperidinyl)-8-azabicyclo[3.2.1]octane
TypeSmall organic molecule
Emp. Form.C26H32Cl2N2
Mol. Mass.443.452
SMILES[H][C@]12CC[C@]([H])(C[C@@H](C1)C1CCCCN1C)N2C(c1ccccc1Cl)c1ccccc1Cl