Reaction Details
TargetNociceptin receptor
LigandBDBM50295432
Substrate/Competitorn/a
Meas. Tech.ChEMBL_578685 (CHEMBL1063066)
Ki 3±n/a nM
Citation Yang, SWHo, GTulshian, DGreenlee, WJAnthes, JFernandez, XMcLeod, RLHey, JAXu, X Discovery of orally active 3-pyridinyl-tropane as a potent nociceptin receptor agonist for the management of cough. J Med Chem52:5323-9 (2009) 
 
Nociceptin receptor
Name:Nociceptin receptor
Type:G Protein-Coupled Receptor (GPCR)
Mol. Mass.:40702.87
Organism:Homo sapiens (Human)
Description:P41146
Residue:370
BDBM50295432
NameBDBM50295432
Synonyms:2-[exo-8-[Bis(2-chlorophenyl)methyl]-8-azabicyclo[3.2.1]oct-3-yl]-1-piperidineacetonitrile | CHEMBL561115
TypeSmall organic molecule
Emp. Form.C27H31Cl2N3
Mol. Mass.468.461
SMILESClc1ccccc1C(N1[C@H]2CC[C@H]1CC(C2)C1CCCCN1CC#N)c1ccccc1Cl