Reaction Details
TargetfMet-Leu-Phe receptor
LigandBDBM50295524
Substrate/Competitorn/a
Meas. Tech.ChEMBL_580004 (CHEMBL1051692)
EC50 2600±n/a nM
Citation Cilibrizzi, AQuinn, MTKirpotina, LNSchepetkin, IAHolderness, JYe, RDRabiet, MJBiancalani, CCesari, NGraziano, AVergelli, CPieretti, SDal Piaz, VGiovannoni, MP 6-methyl-2,4-disubstituted pyridazin-3(2H)-ones: a novel class of small-molecule agonists for formyl peptide receptors. J Med Chem52:5044-57 (2010) 
 
fMet-Leu-Phe receptor
Name:fMet-Leu-Phe receptor
Type:Enzyme Catalytic Domain
Mol. Mass.:38456.14
Organism:Homo sapiens (Human)
Description:gi_4503779
Residue:350
BDBM50295524
NameBDBM50295524
Synonyms:CHEMBL551589 | N-(4-Bromophenyl)-2-[5-(3-methoxybenzyl)-3-methyl-6-oxo-6H-pyridazin-1-yl]-acetamide
TypeSmall organic molecule
Emp. Form.C21H20BrN3O3
Mol. Mass.442.306
SMILESCOc1cccc(Cc2cc(C)nn(CC(=O)Nc3ccc(Br)cc3)c2=O)c1