Reaction Details
TargetN-formyl peptide receptor 2
LigandBDBM50295525
Substrate/Competitorn/a
Meas. Tech.ChEMBL_580005 (CHEMBL1051693)
EC50 11800±n/a nM
Citation Cilibrizzi, AQuinn, MTKirpotina, LNSchepetkin, IAHolderness, JYe, RDRabiet, MJBiancalani, CCesari, NGraziano, AVergelli, CPieretti, SDal Piaz, VGiovannoni, MP 6-methyl-2,4-disubstituted pyridazin-3(2H)-ones: a novel class of small-molecule agonists for formyl peptide receptors. J Med Chem52:5044-57 (2010) 
 
N-formyl peptide receptor 2
Name:N-formyl peptide receptor 2
Type:G Protein-Coupled Receptor (GPCR)
Mol. Mass.:38968.35
Organism:Homo sapiens (Human)
Description:P25090
Residue:351
BDBM50295525
NameBDBM50295525
Synonyms:CHEMBL551590 | N-(4-Bromophenyl)-3-[3-(3-methoxybenzyl)-5-methyl-2-oxo-2H-pyridazin-1-yl]-propionamide
TypeSmall organic molecule
Emp. Form.C22H22BrN3O3
Mol. Mass.456.332
SMILESCOc1cccc(Cc2cc(C)nn(CCC(=O)Nc3ccc(Br)cc3)c2=O)c1