Reaction Details
TargetN-formyl peptide receptor 2
LigandBDBM50295523
Substrate/Competitorn/a
Meas. Tech.ChEMBL_580007 (CHEMBL1051695)
EC50 13100±n/a nM
Citation Cilibrizzi, AQuinn, MTKirpotina, LNSchepetkin, IAHolderness, JYe, RDRabiet, MJBiancalani, CCesari, NGraziano, AVergelli, CPieretti, SDal Piaz, VGiovannoni, MP 6-methyl-2,4-disubstituted pyridazin-3(2H)-ones: a novel class of small-molecule agonists for formyl peptide receptors. J Med Chem52:5044-57 (2010) 
 
N-formyl peptide receptor 2
Name:N-formyl peptide receptor 2
Type:G Protein-Coupled Receptor (GPCR)
Mol. Mass.:38968.35
Organism:Homo sapiens (Human)
Description:P25090
Residue:351
BDBM50295523
NameBDBM50295523
Synonyms:CHEMBL562380 | N-(4-Bromophenyl)-2-[5-(4-methoxybenzyl)-3-methyl-6-oxo-6H-pyridazin-1-yl]-acetamide
TypeSmall organic molecule
Emp. Form.C21H20BrN3O3
Mol. Mass.442.306
SMILESCOc1ccc(Cc2cc(C)nn(CC(=O)Nc3ccc(Br)cc3)c2=O)cc1