Reaction Details
TargetfMet-Leu-Phe receptor
LigandBDBM50295525
Substrate/Competitorn/a
Meas. Tech.ChEMBL_580006 (CHEMBL1051694)
EC50 11300±n/a nM
Citation Cilibrizzi, AQuinn, MTKirpotina, LNSchepetkin, IAHolderness, JYe, RDRabiet, MJBiancalani, CCesari, NGraziano, AVergelli, CPieretti, SDal Piaz, VGiovannoni, MP 6-methyl-2,4-disubstituted pyridazin-3(2H)-ones: a novel class of small-molecule agonists for formyl peptide receptors. J Med Chem52:5044-57 (2010) 
 
fMet-Leu-Phe receptor
Name:fMet-Leu-Phe receptor
Type:Enzyme Catalytic Domain
Mol. Mass.:38456.14
Organism:Homo sapiens (Human)
Description:gi_4503779
Residue:350
BDBM50295525
NameBDBM50295525
Synonyms:CHEMBL551590 | N-(4-Bromophenyl)-3-[3-(3-methoxybenzyl)-5-methyl-2-oxo-2H-pyridazin-1-yl]-propionamide
TypeSmall organic molecule
Emp. Form.C22H22BrN3O3
Mol. Mass.456.332
SMILESCOc1cccc(Cc2cc(C)nn(CCC(=O)Nc3ccc(Br)cc3)c2=O)c1