Reaction Details
TargetN-formyl peptide receptor 2
LigandBDBM50050937
Substrate/Competitorn/a
Meas. Tech.ChEMBL_580002 (CHEMBL1051690)
EC50 20400±n/a nM
Citation Cilibrizzi, AQuinn, MTKirpotina, LNSchepetkin, IAHolderness, JYe, RDRabiet, MJBiancalani, CCesari, NGraziano, AVergelli, CPieretti, SDal Piaz, VGiovannoni, MP 6-methyl-2,4-disubstituted pyridazin-3(2H)-ones: a novel class of small-molecule agonists for formyl peptide receptors. J Med Chem52:5044-57 (2010) 
 
N-formyl peptide receptor 2
Name:N-formyl peptide receptor 2
Type:G Protein-Coupled Receptor (GPCR)
Mol. Mass.:38968.35
Organism:Homo sapiens (Human)
Description:P25090
Residue:351
BDBM50050937
NameBDBM50050937
Synonyms:(S)-2-[(S)-2-((S)-2-Formylamino-4-methylsulfanyl-butyrylamino)-4-methyl-pentanoylamino]-3-phenyl-propionic acid N-formyl-methionyl-leucyl-phenylalanine | N-formylmethionine-leucine-phenylalanine
TypeSmall organic molecule
Emp. Form.C21H31N3O5S
Mol. Mass.437.553
SMILESCSCC[C@H](NC=O)C(=O)N[C@@H](CC(C)C)C(=O)N[C@@H](Cc1ccccc1)C(O)=O