Reaction Details
TargetGlutathione S-transferase A1
LigandBDBM50295555
Substrate/Competitorn/a
Meas. Tech.ChEMBL_579785 (CHEMBL1059686)
Ki 1700±n/a nM
Citation Axarli, ILabrou, NEPetrou, CRassias, NCordopatis, PClonis, YD Sulphonamide-based bombesin prodrug analogues for glutathione transferase, useful in targeted cancer chemotherapy. Eur J Med Chem44:2009-16 (2009) 
 
Glutathione S-transferase A1
Name:Glutathione S-transferase A1
Type:Enzyme
Mol. Mass.:25636.31
Organism:Homo sapiens (Human)
Description:Glutathione-S-Transferase (GST, N-terminally)
Residue:222
BDBM50295555
NameBDBM50295555
Synonyms:C6H5-SO2-Glu-Gln-Arg-Leu-Gly-Asn-Gln-Trp-Ala-Val-Gly-His-Phe-Met-NH2 | CHEMBL556598
TypeSmall organic molecule
Emp. Form.C80H114N24O21S2
Mol. Mass.1812.039
SMILESCSCC[C@H](NC(=O)[C@H](Cc1ccccc1)NC(=O)[C@H](Cc1cnc[nH]1)NC(=O)CNC(=O)[C@@H](NC(=O)[C@H](C)NC(=O)[C@H](Cc1c[nH]c2ccccc12)NC(=O)[C@H](CCC(N)=O)NC(=O)[C@H](CC(N)=O)NC(=O)CNC(=O)[C@H](CC(C)C)NC(=O)[C@H](CCCN=C(N)N)NC(=O)[C@H](CCC(N)=O)NC(=O)[C@H](CCC(O)=O)NS(=O)(=O)c1ccccc1)C(C)C)C(N)=O