Reaction Details
TargetCoagulation factor X
LigandBDBM50295582
Substrate/Competitorn/a
Meas. Tech.ChEMBL_577597 (CHEMBL1059506)
Ki 175±n/a nM
Citation Zbinden, KGAnselm, LBanner, DWBenz, JBlasco, FDécoret, GHimber, JKuhn, BPanday, NRicklin, FRisch, PSchlatter, DStahl, MThomi, SUnger, RHaap, W Design of novel aminopyrrolidine factor Xa inhibitors from a screening hit. Eur J Med Chem44:2787-95 (2009) 
 
Coagulation factor X
Name:Coagulation factor X
Type:Enzyme
Mol. Mass.:54726.60
Organism:Homo sapiens (Human)
Description:n/a
Residue:488
BDBM50295582
NameBDBM50295582
Synonyms:4-chloro-N-(1-(2-(4-(1-methylpiperidin-4-yl)piperazin-1-yl)-2-oxoethyl)-1H-1,2,4-triazol-3-yl)cyclopenta-1,3-dienecarboxamide | CHEMBL562980
TypeSmall organic molecule
Emp. Form.C19H26ClN7O2S
Mol. Mass.451.973
SMILESCN1CCC(CC1)N1CCN(CC1)C(=O)Cn1cnc(NC(=O)c2ccc(Cl)s2)n1