Reaction Details
TargetCoagulation factor X
LigandBDBM50295584
Substrate/Competitorn/a
Meas. Tech.ChEMBL_577597 (CHEMBL1059506)
Ki 11±n/a nM
Citation Zbinden, KGAnselm, LBanner, DWBenz, JBlasco, FDécoret, GHimber, JKuhn, BPanday, NRicklin, FRisch, PSchlatter, DStahl, MThomi, SUnger, RHaap, W Design of novel aminopyrrolidine factor Xa inhibitors from a screening hit. Eur J Med Chem44:2787-95 (2009) 
 
Coagulation factor X
Name:Coagulation factor X
Type:Enzyme
Mol. Mass.:54726.60
Organism:Homo sapiens (Human)
Description:n/a
Residue:488
BDBM50295584
NameBDBM50295584
Synonyms:4-chloro-N-(2-(2-(2-fluoro-4-(2-oxopyridin-1(2H)-yl)phenylamino)-2-oxoethyl)-2H-tetrazol-5-yl)cyclopenta-1,3-dienecarboxamide | CHEMBL563960
TypeSmall organic molecule
Emp. Form.C19H13ClFN7O3S
Mol. Mass.473.868
SMILESFc1cc(ccc1NC(=O)Cn1nnc(NC(=O)c2ccc(Cl)s2)n1)-n1ccccc1=O