Reaction Details
TargetProthrombin
LigandBDBM50295576
Substrate/Competitorn/a
Meas. Tech.ChEMBL_577598 (CHEMBL1059507)
Ki>35000±n/a nM
Citation Zbinden, KGAnselm, LBanner, DWBenz, JBlasco, FDécoret, GHimber, JKuhn, BPanday, NRicklin, FRisch, PSchlatter, DStahl, MThomi, SUnger, RHaap, W Design of novel aminopyrrolidine factor Xa inhibitors from a screening hit. Eur J Med Chem44:2787-95 (2009) 
 
Prothrombin
Name:Prothrombin
Type:Protein
Mol. Mass.:70029.57
Organism:Homo sapiens (Human)
Description:P00734
Residue:622
BDBM50295576
NameBDBM50295576
Synonyms:4-chloro-N-(4-(2-(2-fluoro-4-(2-oxopyridin-1(2H)-yl)phenylamino)-2-oxoethyl)thiazol-2-yl)benzamide | CHEMBL561983
TypeSmall organic molecule
Emp. Form.C23H16ClFN4O3S
Mol. Mass.482.915
SMILESFc1cc(ccc1NC(=O)Cc1csc(NC(=O)c2ccc(Cl)cc2)n1)-n1ccccc1=O