Reaction Details
TargetCoagulation factor X
LigandBDBM50295594
Substrate/Competitorn/a
Meas. Tech.ChEMBL_577597 (CHEMBL1059506)
Ki 43±n/a nM
Citation Zbinden, KGAnselm, LBanner, DWBenz, JBlasco, FDécoret, GHimber, JKuhn, BPanday, NRicklin, FRisch, PSchlatter, DStahl, MThomi, SUnger, RHaap, W Design of novel aminopyrrolidine factor Xa inhibitors from a screening hit. Eur J Med Chem44:2787-95 (2009) 
 
Coagulation factor X
Name:Coagulation factor X
Type:Enzyme
Mol. Mass.:54726.60
Organism:Homo sapiens (Human)
Description:n/a
Residue:488
BDBM50295594
NameBDBM50295594
Synonyms:(+/-)-5-chloro-N-(4-cyclopropyl-1-(2-(2-fluoro-4-(2-oxopyridin-1(2H)-yl)phenylamino)-2-oxoethyl)pyrrolidin-3-yl)thiophene-2-carboxamide | CHEMBL549696
TypeSmall organic molecule
Emp. Form.C25H24ClFN4O3S
Mol. Mass.514.999
SMILESFc1cc(ccc1NC(=O)CN1CC(NC(=O)c2ccc(Cl)s2)C(C1)C1CC1)-n1ccccc1=O