Reaction Details
TargetMelanin-concentrating hormone receptor 1
LigandBDBM50295692
Substrate/Competitorn/a
Meas. Tech.ChEMBL_577916 (CHEMBL1059589)
IC50 0.24±n/a nM
Citation Ito, MSakamoto, TSuzuki, TEgashira, SMoriya, MIshihara, AIwaasa, HMatsushita, HNakase, KWallace, MADean, DSato, NTokita, SKanatani, A Identification and characterization of a selective radioligand for melanin-concentrating hormone 1-receptor (MCH1R). Bioorg Med Chem Lett19:2835-9 (2009) 
 
Melanin-concentrating hormone receptor 1
Name:Melanin-concentrating hormone receptor 1
Type:G Protein-Coupled Receptor (GPCR)
Mol. Mass.:45976.27
Organism:Homo sapiens (Human)
Description:Membranes from CHO-K1 cells stably expressing human MCH1R were used in assays.
Residue:422
BDBM50295692
NameBDBM50295692
Synonyms:CHEMBL555055 | tert-butyl 4-(1-(3,4-difluorophenyl)-2-(ethyl(3-(6-fluoro-3H-spiro[isobenzofuran-1,4'-piperidine]-1'-yl)propyl)amino)-2-oxoethyl)-3-oxopiperazine-1-carboxylate
TypeSmall organic molecule
Emp. Form.C34H43F3N4O5
Mol. Mass.644.7242
SMILESCCN(CCCN1CCC2(CC1)OCc1ccc(F)cc21)C(=O)C(N1CCN(CC1=O)C(=O)OC(C)(C)C)c1ccc(F)c(F)c1