Reaction Details
TargetAdenosine receptor A3
LigandBDBM21220
Substrate/Competitorn/a
Meas. Tech.ChEMBL_578989 (CHEMBL1061438)
Ki 20±n/a nM
Citation Ishiyama, HNakajima, HNakata, HKobayashi, J Synthesis of hybrid analogues of caffeine and eudistomin D and its affinity for adenosine receptors. Bioorg Med Chem17:4280-4 (2009) 
 
Adenosine receptor A3
Name:Adenosine receptor A3
Type:G Protein-Coupled Receptor (GPCR)
Mol. Mass.:36197.32
Organism:Homo sapiens (Human)
Description:P0DMS8
Residue:318
BDBM21220
NameBDBM21220
Synonyms:(2S,3S,4R,5R)-5-(6-amino-9H-purin-9-yl)-N-ethyl-3,4-dihydroxyoxolane-2-carboxamide Adenosine, N6-Ethyl-carboxamido CHEMBL464859 NECA
TypeAntineoplastic Agent
Emp. Form.C12H16N6O4
Mol. Mass.308.2932
SMILESCCNC(=O)[C@H]1O[C@H]([C@H](O)[C@@H]1O)n1cnc2c(N)ncnc12