Reaction Details
TargetNeuronal acetylcholine receptor subunit alpha-3
LigandBDBM50295954
Substrate/Competitorn/a
Meas. Tech.ChEMBL_578994 (CHEMBL1061443)
Ki 0.33±n/a nM
Citation Gao, YRavert, HTKuwabara, HXiao, YEndres, CJHilton, JHolt, DPKumar, AAlexander, MWong, DFDannals, RFHorti, AG Synthesis and biological evaluation of novel carbon-11 labeled pyridyl ethers: candidate ligands for in vivo imaging of alpha4beta2 nicotinic acetylcholine receptors (alpha4beta2-nAChRs) in the brain with positron emission tomography. Bioorg Med Chem17:4367-77 (2009) 
 
Neuronal acetylcholine receptor subunit alpha-3
Name:Neuronal acetylcholine receptor subunit alpha-3
Type:Enzyme
Mol. Mass.:56995.52
Organism:Rattus norvegicus (Rat)
Description:P04757
Residue:499
BDBM50295954
NameBDBM50295954
Synonyms:2-Chloro-3-(2-fluoro-4-(pyridinyl)methoxy)-5-((1-methyl-2-(S)-pyrrolidinyl)methoxy)pyridine | CHEMBL563479
TypeSmall organic molecule
Emp. Form.C17H19ClFN3O2
Mol. Mass.351.803
SMILESCN1CCC[C@H]1COc1cnc(Cl)c(OCc2ccnc(F)c2)c1