Reaction Details
TargetNeuronal acetylcholine receptor subunit alpha-3
LigandBDBM50295957
Substrate/Competitorn/a
Meas. Tech.ChEMBL_578994 (CHEMBL1061443)
Ki 0.85±n/a nM
Citation Gao, YRavert, HTKuwabara, HXiao, YEndres, CJHilton, JHolt, DPKumar, AAlexander, MWong, DFDannals, RFHorti, AG Synthesis and biological evaluation of novel carbon-11 labeled pyridyl ethers: candidate ligands for in vivo imaging of alpha4beta2 nicotinic acetylcholine receptors (alpha4beta2-nAChRs) in the brain with positron emission tomography. Bioorg Med Chem17:4367-77 (2009) 
 
Neuronal acetylcholine receptor subunit alpha-3
Name:Neuronal acetylcholine receptor subunit alpha-3
Type:Enzyme
Mol. Mass.:56995.52
Organism:Rattus norvegicus (Rat)
Description:P04757
Residue:499
BDBM50295957
NameBDBM50295957
Synonyms:2-Chloro-3-(2-chloro-5-(pyridinyl)methoxy)-5-((1-methyl)-2-(R)-pyrrolidinyl)methoxy)pyridine | CHEMBL551062
TypeSmall organic molecule
Emp. Form.C17H19Cl2N3O2
Mol. Mass.368.258
SMILESCN1CCC[C@@H]1COc1cnc(Cl)c(OCc2ccc(Cl)nc2)c1