Reaction Details
TargetNeuronal acetylcholine receptor subunit alpha-4
LigandBDBM50295954
Substrate/Competitorn/a
Meas. Tech.ChEMBL_578996 (CHEMBL1061445)
Ki 0.062±n/a nM
Citation Gao, YRavert, HTKuwabara, HXiao, YEndres, CJHilton, JHolt, DPKumar, AAlexander, MWong, DFDannals, RFHorti, AG Synthesis and biological evaluation of novel carbon-11 labeled pyridyl ethers: candidate ligands for in vivo imaging of alpha4beta2 nicotinic acetylcholine receptors (alpha4beta2-nAChRs) in the brain with positron emission tomography. Bioorg Med Chem17:4367-77 (2009) 
 
Neuronal acetylcholine receptor subunit alpha-4
Name:Neuronal acetylcholine receptor subunit alpha-4
Type:Enzyme
Mol. Mass.:70196.44
Organism:Rattus norvegicus (Rat)
Description:P09483
Residue:630
BDBM50295954
NameBDBM50295954
Synonyms:2-Chloro-3-(2-fluoro-4-(pyridinyl)methoxy)-5-((1-methyl-2-(S)-pyrrolidinyl)methoxy)pyridine | CHEMBL563479
TypeSmall organic molecule
Emp. Form.C17H19ClFN3O2
Mol. Mass.351.803
SMILESCN1CCC[C@H]1COc1cnc(Cl)c(OCc2ccnc(F)c2)c1