Reaction Details
TargetTyrosinase
LigandBDBM50296245
Substrate/Competitorn/a
Meas. Tech.ChEMBL_579688 (CHEMBL1053202)
Ki 64000±n/a nM
Citation Yamazaki, YKawano, YYamanaka, AMaruyama, S N-[(Dihydroxyphenyl)acyl]serotonins as potent inhibitors of tyrosinase from mouse and human melanoma cells. Bioorg Med Chem Lett19:4178-82 (2009) 
 
Tyrosinase
Name:Tyrosinase
Type:Protein
Mol. Mass.:60600.74
Organism:Mus musculus (Mouse)
Description:n/a
Residue:533
BDBM50296245
NameBDBM50296245
Synonyms:3,4-Dihydroxy-N-[2-(5-hydroxyindol-3-yl)ethyl]benzamide | CHEMBL552171
TypeSmall organic molecule
Emp. Form.C17H16N2O4
Mol. Mass.312.3199
SMILESOc1ccc2[nH]cc(CCNC(=O)c3ccc(O)c(O)c3)c2c1