Reaction Details
TargetTyrosinase
LigandBDBM50414514
Substrate/Competitorn/a
Meas. Tech.ChEMBL_579688 (CHEMBL1053202)
Ki 3700±n/a nM
Citation Yamazaki, YKawano, YYamanaka, AMaruyama, S N-[(Dihydroxyphenyl)acyl]serotonins as potent inhibitors of tyrosinase from mouse and human melanoma cells. Bioorg Med Chem Lett19:4178-82 (2009) 
 
Tyrosinase
Name:Tyrosinase
Type:Protein
Mol. Mass.:60600.74
Organism:Mus musculus (Mouse)
Description:n/a
Residue:533
BDBM50414514
NameBDBM50414514
Synonyms:PROTOCATECHUAMIDE
TypeSmall organic molecule
Emp. Form.C7H7NO3
Mol. Mass.153.1354
SMILESNC(=O)c1ccc(O)c(O)c1