Reaction Details
TargetCarbonic anhydrase 2
LigandBDBM50296250
Substrate/Competitorn/a
Meas. Tech.ChEMBL_579711 (CHEMBL1053952)
IC50 59±n/a nM
Citation Parkkila, SInnocenti, AKallio, HHilvo, MScozzafava, ASupuran, CT The protein tyrosine kinase inhibitors imatinib and nilotinib strongly inhibit several mammalian alpha-carbonic anhydrase isoforms. Bioorg Med Chem Lett19:4102-6 (2009) 
 
Carbonic anhydrase 2
Name:Carbonic anhydrase 2
Type:Enzyme
Mol. Mass.:29250.71
Organism:Homo sapiens (Human)
Description:P00918
Residue:260
BDBM50296250
NameBDBM50296250
Synonyms:(S,Z)-3-(2-hydroxy-5-(1-hydroxy-3-methylbutyl)-4-methoxyphenyl)acrylate | CHEMBL560175
TypeSmall organic molecule
Emp. Form.C15H20O5
Mol. Mass.280.3163
SMILESCOc1cc(O)c(\C=C/C(O)=O)cc1[C@@H](O)CC(C)C