Reaction Details
TargetCarbonic anhydrase 5B, mitochondrial
LigandBDBM50237710
Substrate/Competitorn/a
Meas. Tech.ChEMBL_579715 (CHEMBL1053956)
Ki 14920±n/a nM
Citation Parkkila, SInnocenti, AKallio, HHilvo, MScozzafava, ASupuran, CT The protein tyrosine kinase inhibitors imatinib and nilotinib strongly inhibit several mammalian alpha-carbonic anhydrase isoforms. Bioorg Med Chem Lett19:4102-6 (2009) 
 
Carbonic anhydrase 5B, mitochondrial
Name:Carbonic anhydrase 5B, mitochondrial
Type:Enzyme
Mol. Mass.:36440.83
Organism:Homo sapiens (Human)
Description:Human (cloned) isozyme
Residue:317
BDBM50237710
NameBDBM50237710
Synonyms:4-methyl-N-[3-(4-methyl-1H-imidazol-1-yl)-5-(trifluoromethyl)phenyl]-3-[(4-pyridin-3-ylpyrimidin-2-yl)amino]benzamide AMN107 NILOTINIB | US11649218, Example Nilotinib
TypeSmall organic molecule
Emp. Form.C28H22F3N7O
Mol. Mass.529.5158
SMILESCc1cn(cn1)-c1cc(NC(=O)c2ccc(C)c(Nc3nccc(n3)-c3cccnc3)c2)cc(c1)C(F)(F)F