Reaction Details
TargetCarboxypeptidase A1
LigandBDBM50296411
Substrate/Competitorn/a
Meas. Tech.ChEMBL_580787 (CHEMBL1059769)
Ki 2100±n/a nM
Citation Fernández, DAvilés, FXVendrell, J A new type of five-membered heterocyclic inhibitors of basic metallocarboxypeptidases. Eur J Med Chem44:3266-71 (2009) 
 
Carboxypeptidase A1
Name:Carboxypeptidase A1
Type:Enzyme
Mol. Mass.:47073.90
Organism:Bos taurus (bovine)
Description:From Sigma-Aldrich Co.
Residue:419
BDBM50296411
NameBDBM50296411
Synonyms:1-(4-chlorophenyl)-2-(5-(2-hydroxyphenyl)-1,3,4-oxadiazol-2-ylthio)ethanone | CHEMBL563051
TypeSmall organic molecule
Emp. Form.C16H11ClN2O3S
Mol. Mass.346.788
SMILESOc1ccccc1-c1nnc(SCC(=O)c2ccc(Cl)cc2)o1