Reaction Details
TargetCarboxypeptidase B
LigandBDBM50296417
Substrate/Competitorn/a
Meas. Tech.ChEMBL_580862 (CHEMBL1064194)
Ki 7400±n/a nM
Citation Fernández, DAvilés, FXVendrell, J A new type of five-membered heterocyclic inhibitors of basic metallocarboxypeptidases. Eur J Med Chem44:3266-71 (2009) 
 
Carboxypeptidase B
Name:Carboxypeptidase B
Type:Enzyme
Mol. Mass.:47367.43
Organism:Homo sapiens (Human)
Description:P15086
Residue:417
BDBM50296417
NameBDBM50296417
Synonyms:CHEMBL561592 | isopropyl 2-(4-benzyl-5-(2-methoxyphenyl)-4H-1,2,4-triazol-3-ylthio)acetate
TypeSmall organic molecule
Emp. Form.C21H23N3O3S
Mol. Mass.397.491
SMILESCOc1ccccc1-c1nnc(SCC(=O)OC(C)C)n1Cc1ccccc1