Reaction Details
TargetCarboxypeptidase B
LigandBDBM50296420
Substrate/Competitorn/a
Meas. Tech.ChEMBL_580786 (CHEMBL1059768)
Ki 11900±n/a nM
Citation Fernández, DAvilés, FXVendrell, J A new type of five-membered heterocyclic inhibitors of basic metallocarboxypeptidases. Eur J Med Chem44:3266-71 (2009) 
 
Carboxypeptidase B
Name:Carboxypeptidase B
Synonyms:CPB
Type:Enzyme
Mol. Mass.:48382.46
Organism:Helicoverpa zea (Corn earworm moth) (Heliothis zea)
Description:Q3T905
Residue:429
BDBM50296420
NameBDBM50296420
TypeSmall organic molecule
Emp. Form.C20H29N3O3S
Mol. Mass.391.528
SMILESCCOC(=O)C(Sc1nnc(COc2ccc(CC)cc2)n1CC)C(C)C