Reaction Details
TargetCarboxypeptidase B
LigandBDBM50296418
Substrate/Competitorn/a
Meas. Tech.ChEMBL_580862 (CHEMBL1064194)
Ki 15000±n/a nM
Citation Fernández, DAvilés, FXVendrell, J A new type of five-membered heterocyclic inhibitors of basic metallocarboxypeptidases. Eur J Med Chem44:3266-71 (2009) 
 
Carboxypeptidase B
Name:Carboxypeptidase B
Type:Enzyme
Mol. Mass.:47367.43
Organism:Homo sapiens (Human)
Description:P15086
Residue:417
BDBM50296418
NameBDBM50296418
Synonyms:2-(6,9-dimethyl-5H-[1,2,4]triazino[5,6-b]indol-3-ylthio)-1-(4-fluorophenyl)ethanone | CHEMBL559480
TypeSmall organic molecule
Emp. Form.C19H15FN4OS
Mol. Mass.366.412
SMILESCc1ccc(C)c2c3nnc(SCC(=O)c4ccc(F)cc4)nc3[nH]c12