Reaction Details
TargetCarboxypeptidase B
LigandBDBM50296425
Substrate/Competitorn/a
Meas. Tech.ChEMBL_580786 (CHEMBL1059768)
Ki 18000±n/a nM
Citation Fernández, DAvilés, FXVendrell, J A new type of five-membered heterocyclic inhibitors of basic metallocarboxypeptidases. Eur J Med Chem44:3266-71 (2009) 
 
Carboxypeptidase B
Name:Carboxypeptidase B
Synonyms:CPB
Type:Enzyme
Mol. Mass.:48382.46
Organism:Helicoverpa zea (Corn earworm moth) (Heliothis zea)
Description:Q3T905
Residue:429
BDBM50296425
NameBDBM50296425
TypeSmall organic molecule
Emp. Form.C19H24N4O3S
Mol. Mass.388.484
SMILESCc1ccc(cc1)S(=O)(=O)N1CCN(CC1)C(=O)CNCc1ccncc1