Reaction Details
TargetSodium-dependent dopamine transporter
LigandBDBM50296782
Substrate/Competitorn/a
Meas. Tech.ChEMBL_582526 (CHEMBL1060859)
Ki 16±n/a nM
Citation Schou, MSteiger, CVarrone, AGuilloteau, DHalldin, C Synthesis, radiolabeling and preliminary in vivo evaluation of [18F]FE-PE2I, a new probe for the dopamine transporter. Bioorg Med Chem Lett19:4843-5 (2009) 
 
Sodium-dependent dopamine transporter
Name:Sodium-dependent dopamine transporter
Type:Multi-pass membrane protein
Mol. Mass.:68749.45
Organism:Rattus norvegicus (rat)
Description:P23977
Residue:619
BDBM50296782
NameBDBM50296782
Synonyms:(1R,2S,3S,5S)-methyl 8-((E)-3-iodoallyl)-3-p-tolyl-8-azabicyclo[3.2.1]octane-2-carboxylate PE2I
TypeSmall organic molecule
Emp. Form.C19H24INO2
Mol. Mass.425.3038
SMILESCOC(=O)[C@@H]1[C@H]2CC[C@@H](C[C@@H]1c1ccc(C)cc1)N2C\C=C\I