Reaction Details
TargetAndrogen receptor
LigandBDBM7458
Substrate/Competitorn/a
Meas. Tech.ChEMBL_580463 (CHEMBL1052490)
IC50 5200±n/a nM
Citation Nishizaki, YIshimoto, YHotta, YHosoda, AYoshikawa, HAkamatsu, MTamura, H Effect of flavonoids on androgen and glucocorticoid receptors based on in vitro reporter gene assay. Bioorg Med Chem Lett19:4706-10 (2009) 
 
Androgen receptor
Name:Androgen receptor
Type:Receptor
Mol. Mass.:99185.27
Organism:Homo sapiens (Human)
Description:CHO cells were stably transfected with human AR gene.
Residue:920
BDBM7458
NameBDBM7458
Synonyms:5,7-dihydroxy-2-(4-hydroxyphenyl)-4H-chromen-4-one Apigenin Apigenin (3) Apigenin, 13 Naringenin, 18 US11337935, Compound Apigenin cid_5280443 | jm5b01461, Compound 90
TypeSmall organic molecule
Emp. Form.C15H10O5
Mol. Mass.270.2369
SMILESOc1ccc(cc1)-c1cc(=O)c2c(O)cc(O)cc2o1