Reaction Details
TargetPotassium voltage-gated channel subfamily H member 2
LigandBDBM50296876
Substrate/Competitorn/a
Meas. Tech.ChEMBL_580515 (CHEMBL1053229)
IC50 2100±n/a nM
Citation Cho, KAndo, MKobayashi, KMiyazoe, HTsujino, TIto, SSuzuki, TTanaka, TTokita, SSato, N Design, synthesis and evaluation of a novel cyclohexanamine class of neuropeptide Y Y1 receptor antagonists. Bioorg Med Chem Lett19:4781-5 (2009) 
 
Potassium voltage-gated channel subfamily H member 2
Name:Potassium voltage-gated channel subfamily H member 2
Type:Multi-pass membrane protein
Mol. Mass.:126672.65
Organism:Homo sapiens (Human)
Description:Q12809
Residue:1159
BDBM50296876
NameBDBM50296876
Synonyms:(4-(6-chloropyridin-3-yl)-4-phenylpiperidin-1-yl)((1R,4R)-4-((R)-1-(4-methoxyphenyl)ethylamino)-2,2-dimethylcyclohexyl)methanone | CHEMBL551206
TypeSmall organic molecule
Emp. Form.C34H42ClN3O2
Mol. Mass.560.169
SMILESCOc1ccc(cc1)[C@@H](C)N[C@@H]1CC[C@@H](C(=O)N2CCC(CC2)(c2ccccc2)c2ccc(Cl)nc2)C(C)(C)C1