Reaction Details
TargetNeuropeptide Y receptor type 1
LigandBDBM50296874
Substrate/Competitorn/a
Meas. Tech.ChEMBL_580514 (CHEMBL1053228)
Ki 49±n/a nM
Citation Cho, KAndo, MKobayashi, KMiyazoe, HTsujino, TIto, SSuzuki, TTanaka, TTokita, SSato, N Design, synthesis and evaluation of a novel cyclohexanamine class of neuropeptide Y Y1 receptor antagonists. Bioorg Med Chem Lett19:4781-5 (2009) 
 
Neuropeptide Y receptor type 1
Name:Neuropeptide Y receptor type 1
Type:Enzyme Catalytic Domain
Mol. Mass.:44399.07
Organism:Homo sapiens (Human)
Description:NPY-Y1 NPY1R HUMAN::P25929
Residue:384
BDBM50296874
NameBDBM50296874
Synonyms:CHEMBL561193 | N-(4-((1R,4R)-4-((R)-1-(4-methoxyphenyl)ethylamino)-2,2-dimethylcyclohexanecarbonyl)-1-phenylcyclohexyl)-N-methylacetamide
TypeSmall organic molecule
Emp. Form.C33H46N2O3
Mol. Mass.518.7299
SMILESCOc1ccc(cc1)[C@@H](C)N[C@@H]1CC[C@@H](C(=O)C2CCC(CC2)(N(C)C(C)=O)c2ccccc2)C(C)(C)C1